Reaction Details
TargetCyclin-dependent kinase 2
LigandBDBM50274807
Substrate/Competitorn/a
Meas. Tech.ChEMBL_536407 (CHEMBL992478)
IC50 36±n/a nM
Citation Anderson, MAndrews, DMBarker, AJBrassington, CABreed, JByth, KFCulshaw, JDFinlay, MRFisher, EMcMiken, HHGreen, CPHeaton, DWNash, IANewcombe, NJOakes, SEPauptit, RARoberts, AStanway, JJThomas, APTucker, JAWalker, MWeir, HM Imidazoles: SAR and development of a potent class of cyclin-dependent kinase inhibitors. Bioorg Med Chem Lett18:5487-92 (2008) 
 
Cyclin-dependent kinase 2
Name:Cyclin-dependent kinase 2
Type:Enzyme Subunit
Mol. Mass.:33938.17
Organism:Homo sapiens (Human)
Description:P24941
Residue:298
BDBM50274807
NameBDBM50274807
Synonyms:CHEMBL457887 | N-(4-(3-(dimethylamino)propylsulfonyl)phenyl)-4-(1-isopropyl-2-methyl-1H-imidazol-5-yl)pyrimidin-2-amine
TypeSmall organic molecule
Emp. Form.C22H30N6O2S
Mol. Mass.442.578
SMILESCC(C)n1c(C)ncc1-c1ccnc(Nc2ccc(cc2)S(=O)(=O)CCCN(C)C)n1