Reaction Details
TargetCyclin-dependent kinase 4
LigandBDBM50274661
Substrate/Competitorn/a
Meas. Tech.ChEMBL_536408 (CHEMBL992479)
IC50 5600±n/a nM
Citation Anderson, MAndrews, DMBarker, AJBrassington, CABreed, JByth, KFCulshaw, JDFinlay, MRFisher, EMcMiken, HHGreen, CPHeaton, DWNash, IANewcombe, NJOakes, SEPauptit, RARoberts, AStanway, JJThomas, APTucker, JAWalker, MWeir, HM Imidazoles: SAR and development of a potent class of cyclin-dependent kinase inhibitors. Bioorg Med Chem Lett18:5487-92 (2008) 
 
Cyclin-dependent kinase 4
Name:Cyclin-dependent kinase 4
Type:Enzyme Subunit
Mol. Mass.:33731.96
Organism:Homo sapiens (Human)
Description:P11802
Residue:303
BDBM50274661
NameBDBM50274661
Synonyms:4-(4-(1,2-dimethyl-1H-imidazol-5-yl)pyrimidin-2-ylamino)-N-(2-methoxyethyl)benzenesulfonamide | CHEMBL520187
TypeSmall organic molecule
Emp. Form.C18H22N6O3S
Mol. Mass.402.471
SMILESCOCCNS(=O)(=O)c1ccc(Nc2nccc(n2)-c2cnc(C)n2C)cc1