Reaction Details
TargetDual specificity mitogen-activated protein kinase kinase 1
LigandBDBM50274438
Substrate/Competitorn/a
Meas. Tech.ChEMBL_536668 (CHEMBL995059)
IC50 3±n/a nM
Citation Berger, DMDutia, MPowell, DFloyd, MBTorres, NMallon, RWojciechowicz, DKim, SFeldberg, LCollins, KChaudhary, I 4-Anilino-7-alkenylquinoline-3-carbonitriles as potent MEK1 kinase inhibitors. Bioorg Med Chem16:9202-11 (2008) 
 
Dual specificity mitogen-activated protein kinase kinase 1
Name:Dual specificity mitogen-activated protein kinase kinase 1
Type:Other Protein Type
Mol. Mass.:43439.03
Organism:Homo sapiens (Human)
Description:Full-length human MEK-1 was generated by PCR and purified as a fusion protein from Escherichia coli lysates.
Residue:393
BDBM50274438
NameBDBM50274438
Synonyms:4-({3-Chloro-4-[(1-methyl-1H-imidazol-2-yl)thio]phenyl}-amino)-7-[(1E)-4-(diethylamino)but-1-enyl]-6-methoxyquinoline-3-carbonitrile | CHEMBL485615
TypeSmall organic molecule
Emp. Form.C29H31ClN6OS
Mol. Mass.547.114
SMILESCCN(CC)CC\C=C\c1cc2ncc(C#N)c(Nc3ccc(Sc4nccn4C)c(Cl)c3)c2cc1OC