Reaction Details
TargetDual specificity mitogen-activated protein kinase kinase 1
LigandBDBM50274439
Substrate/Competitorn/a
Meas. Tech.ChEMBL_536668 (CHEMBL995059)
IC50 4±n/a nM
Citation Berger, DMDutia, MPowell, DFloyd, MBTorres, NMallon, RWojciechowicz, DKim, SFeldberg, LCollins, KChaudhary, I 4-Anilino-7-alkenylquinoline-3-carbonitriles as potent MEK1 kinase inhibitors. Bioorg Med Chem16:9202-11 (2008) 
 
Dual specificity mitogen-activated protein kinase kinase 1
Name:Dual specificity mitogen-activated protein kinase kinase 1
Type:Other Protein Type
Mol. Mass.:43439.03
Organism:Homo sapiens (Human)
Description:Full-length human MEK-1 was generated by PCR and purified as a fusion protein from Escherichia coli lysates.
Residue:393
BDBM50274439
NameBDBM50274439
Synonyms:4-({3-Chloro-4-[(1-methyl-1H-imidazol-2-yl)thio]phenyl}-amino)-6-methoxy-7-[(1E)-4-(4-methylpiperazin-1-yl)but-1-enyl]quinoline-3-carbonitrile | CHEMBL524111
TypeSmall organic molecule
Emp. Form.C30H32ClN7OS
Mol. Mass.574.139
SMILESCOc1cc2c(Nc3ccc(Sc4nccn4C)c(Cl)c3)c(cnc2cc1\C=C\CCN1CCN(C)CC1)C#N