Reaction Details
TargetCytochrome P450 3A4
LigandBDBM50252776
Substrate/Competitorn/a
Meas. Tech.ChEMBL_539794 (CHEMBL1035787)
IC50 10000±n/a nM
Citation Pettus, LHXu, SCao, GQChakrabarti, PPRzasa, RMSham, KWurz, RPZhang, DMiddleton, SHenkle, BPlant, MHSaris, CJSherman, LWong, LMPowers, DATudor, YYu, VLee, MRSyed, RHsieh, FTasker, AS 3-amino-7-phthalazinylbenzoisoxazoles as a novel class of potent, selective, and orally available inhibitors of p38alpha mitogen-activated protein kinase. J Med Chem51:6280-92 (2008) 
 
Cytochrome P450 3A4
Name:Cytochrome P450 3A4
Type:Enzyme
Mol. Mass.:57349.57
Organism:Homo sapiens (Human)
Description:n/a
Residue:503
BDBM50252776
NameBDBM50252776
Synonyms:CHEMBL495493 | N-Ethyl-6-methyl-7-(1-((S)-3-methylmorpholino)phthalazin-6-yl)benzo[d]isoxazol-3-amine
TypeSmall organic molecule
Emp. Form.C23H25N5O2
Mol. Mass.403.4769
SMILESCCNc1noc2c(c(C)ccc12)-c1ccc2c(nncc2c1)N1CCOC[C@@H]1C