Reaction Details
TargetMitogen-activated protein kinase 14
LigandBDBM50252738
Substrate/Competitorn/a
Meas. Tech.ChEMBL_539791 (CHEMBL1035784)
Ki 2±n/a nM
Citation Pettus, LHXu, SCao, GQChakrabarti, PPRzasa, RMSham, KWurz, RPZhang, DMiddleton, SHenkle, BPlant, MHSaris, CJSherman, LWong, LMPowers, DATudor, YYu, VLee, MRSyed, RHsieh, FTasker, AS 3-amino-7-phthalazinylbenzoisoxazoles as a novel class of potent, selective, and orally available inhibitors of p38alpha mitogen-activated protein kinase. J Med Chem51:6280-92 (2008) 
 
Mitogen-activated protein kinase 14
Name:Mitogen-activated protein kinase 14
Type:Serine/threonine-protein kinase
Mol. Mass.:41286.76
Organism:Homo sapiens (Human)
Description:Q16539
Residue:360
BDBM50252738
NameBDBM50252738
Synonyms:6-Methyl-7-(1-((S)-3-methylmorpholino)phthalazin-6-yl)benzo[d]isothiazol-3-amine | CHEMBL524054
TypeSmall organic molecule
Emp. Form.C21H21N5OS
Mol. Mass.391.489
SMILESC[C@H]1COCCN1c1nncc2cc(ccc12)-c1c(C)ccc2c(N)nsc12