Reaction Details
TargetMitogen-activated protein kinase 14
LigandBDBM50253151
Substrate/Competitorn/a
Meas. Tech.ChEMBL_539791 (CHEMBL1035784)
Ki 16±n/a nM
Citation Pettus, LHXu, SCao, GQChakrabarti, PPRzasa, RMSham, KWurz, RPZhang, DMiddleton, SHenkle, BPlant, MHSaris, CJSherman, LWong, LMPowers, DATudor, YYu, VLee, MRSyed, RHsieh, FTasker, AS 3-amino-7-phthalazinylbenzoisoxazoles as a novel class of potent, selective, and orally available inhibitors of p38alpha mitogen-activated protein kinase. J Med Chem51:6280-92 (2008) 
 
Mitogen-activated protein kinase 14
Name:Mitogen-activated protein kinase 14
Type:Serine/threonine-protein kinase
Mol. Mass.:41286.76
Organism:Homo sapiens (Human)
Description:Q16539
Residue:360
BDBM50253151
NameBDBM50253151
Synonyms:6-Methyl-7-(1-((S)-3-methylmorpholino)phthalazin-6-yl)-1Hindazol-3-amine | CHEMBL493707
TypeSmall organic molecule
Emp. Form.C21H22N6O
Mol. Mass.374.439
SMILESC[C@H]1COCCN1c1nncc2cc(ccc12)-c1c(C)ccc2c(N)n[nH]c12