Reaction Details
TargetMitogen-activated protein kinase 14
LigandBDBM50253101
Substrate/Competitorn/a
Meas. Tech.ChEMBL_539791 (CHEMBL1035784)
Ki 1.1±n/a nM
Citation Pettus, LHXu, SCao, GQChakrabarti, PPRzasa, RMSham, KWurz, RPZhang, DMiddleton, SHenkle, BPlant, MHSaris, CJSherman, LWong, LMPowers, DATudor, YYu, VLee, MRSyed, RHsieh, FTasker, AS 3-amino-7-phthalazinylbenzoisoxazoles as a novel class of potent, selective, and orally available inhibitors of p38alpha mitogen-activated protein kinase. J Med Chem51:6280-92 (2008) 
 
Mitogen-activated protein kinase 14
Name:Mitogen-activated protein kinase 14
Type:Serine/threonine-protein kinase
Mol. Mass.:41286.76
Organism:Homo sapiens (Human)
Description:Q16539
Residue:360
BDBM50253101
NameBDBM50253101
Synonyms:7-(1-Isopropylphthalazin-6-yl)-N,6-dimethylbenzo[d]isoxazol-3-amine | CHEMBL492661
TypeSmall organic molecule
Emp. Form.C20H20N4O
Mol. Mass.332.399
SMILESCNc1noc2c(c(C)ccc12)-c1ccc2c(nncc2c1)C(C)C