Reaction Details
TargetMitogen-activated protein kinase 14
LigandBDBM50253147
Substrate/Competitorn/a
Meas. Tech.ChEMBL_539791 (CHEMBL1035784)
Ki 0.5±n/a nM
Citation Pettus, LHXu, SCao, GQChakrabarti, PPRzasa, RMSham, KWurz, RPZhang, DMiddleton, SHenkle, BPlant, MHSaris, CJSherman, LWong, LMPowers, DATudor, YYu, VLee, MRSyed, RHsieh, FTasker, AS 3-amino-7-phthalazinylbenzoisoxazoles as a novel class of potent, selective, and orally available inhibitors of p38alpha mitogen-activated protein kinase. J Med Chem51:6280-92 (2008) 
 
Mitogen-activated protein kinase 14
Name:Mitogen-activated protein kinase 14
Type:Serine/threonine-protein kinase
Mol. Mass.:41286.76
Organism:Homo sapiens (Human)
Description:Q16539
Residue:360
BDBM50253147
NameBDBM50253147
Synonyms:CHEMBL494305 | N-Isopropyl-6-(6-methyl-3-(methylamino)benzo[d]isoxazol-7-yl)phthalazin-1-amine
TypeSmall organic molecule
Emp. Form.C20H21N5O
Mol. Mass.347.4136
SMILESCNc1noc2c(c(C)ccc12)-c1ccc2c(NC(C)C)nncc2c1