Reaction Details
TargetCytochrome P450 3A4
LigandBDBM50252735
Substrate/Competitorn/a
Meas. Tech.ChEMBL_539794 (CHEMBL1035787)
IC50 1800±n/a nM
Citation Pettus, LHXu, SCao, GQChakrabarti, PPRzasa, RMSham, KWurz, RPZhang, DMiddleton, SHenkle, BPlant, MHSaris, CJSherman, LWong, LMPowers, DATudor, YYu, VLee, MRSyed, RHsieh, FTasker, AS 3-amino-7-phthalazinylbenzoisoxazoles as a novel class of potent, selective, and orally available inhibitors of p38alpha mitogen-activated protein kinase. J Med Chem51:6280-92 (2008) 
 
Cytochrome P450 3A4
Name:Cytochrome P450 3A4
Type:Enzyme
Mol. Mass.:57349.57
Organism:Homo sapiens (Human)
Description:n/a
Residue:503
BDBM50252735
NameBDBM50252735
Synonyms:CHEMBL495084 | N-Cyclopropyl-6-methyl-7-(1-o-tolylphthalazin-6-yl)benzo[d]-isoxazol-3-amine
TypeSmall organic molecule
Emp. Form.C26H22N4O
Mol. Mass.406.4791
SMILESCc1ccccc1-c1nncc2cc(ccc12)-c1c(C)ccc2c(NC3CC3)noc12