Reaction Details
TargetPlatelet-derived growth factor receptor beta
LigandBDBM50252777
Substrate/Competitorn/a
Meas. Tech.ChEMBL_539811 (CHEMBL1035804)
IC50 830±n/a nM
Citation Pettus, LHXu, SCao, GQChakrabarti, PPRzasa, RMSham, KWurz, RPZhang, DMiddleton, SHenkle, BPlant, MHSaris, CJSherman, LWong, LMPowers, DATudor, YYu, VLee, MRSyed, RHsieh, FTasker, AS 3-amino-7-phthalazinylbenzoisoxazoles as a novel class of potent, selective, and orally available inhibitors of p38alpha mitogen-activated protein kinase. J Med Chem51:6280-92 (2008) 
 
Platelet-derived growth factor receptor beta
Name:Platelet-derived growth factor receptor beta
Type:Enzyme
Mol. Mass.:123922.25
Organism:Homo sapiens (Human)
Description:P09619
Residue:1106
BDBM50252777
NameBDBM50252777
Synonyms:CHEMBL523374 | N,6-Dimethyl-7-(1-((S)-3-methylmorpholino)phthalazin-6-yl)-benzo[d]isoxazol-3-amine
TypeSmall organic molecule
Emp. Form.C22H23N5O2
Mol. Mass.389.4503
SMILESCNc1noc2c(c(C)ccc12)-c1ccc2c(nncc2c1)N1CCOC[C@@H]1C