Reaction Details
TargetCytochrome P450 2D6
LigandBDBM50252736
Substrate/Competitorn/a
Meas. Tech.ChEMBL_539795 (CHEMBL1035788)
IC50>25000±n/a nM
Citation Pettus, LHXu, SCao, GQChakrabarti, PPRzasa, RMSham, KWurz, RPZhang, DMiddleton, SHenkle, BPlant, MHSaris, CJSherman, LWong, LMPowers, DATudor, YYu, VLee, MRSyed, RHsieh, FTasker, AS 3-amino-7-phthalazinylbenzoisoxazoles as a novel class of potent, selective, and orally available inhibitors of p38alpha mitogen-activated protein kinase. J Med Chem51:6280-92 (2008) 
 
Cytochrome P450 2D6
Name:Cytochrome P450 2D6
Type:Protein
Mol. Mass.:55774.82
Organism:Homo sapiens (Human)
Description:P10635
Residue:497
BDBM50252736
NameBDBM50252736
Synonyms:CHEMBL522877 | N-Cyclopropyl-6-methyl-7-(1-((S)-3-methylmorpholino)phthalazin-6-yl)benzo[d]isoxazol-3-amine
TypeSmall organic molecule
Emp. Form.C24H25N5O2
Mol. Mass.415.4876
SMILESC[C@H]1COCCN1c1nncc2cc(ccc12)-c1c(C)ccc2c(NC3CC3)noc12