Reaction Details
TargetCholinesterase
LigandBDBM10624
Substrate/Competitorn/a
Meas. Tech.ChEMBL_534768 (CHEMBL986292)
IC50 255000±n/a nM
Citation Carolan, CGDillon, GPGaynor, JMReidy, SRyder, SAKhan, DMarquez, JFGilmer, JF Isosorbide-2-carbamate esters: potent and selective butyrylcholinesterase inhibitors. J Med Chem51:6400-9 (2008) 
 
Cholinesterase
Name:Cholinesterase
Type:Homotetramer
Mol. Mass.:68422.27
Organism:Homo sapiens (Human)
Description:P06276
Residue:602
BDBM10624
NameBDBM10624
Synonyms:1,5-bis(4-allyldimethylammoniumphenyl)-pentan-3-one dibromide BW284c51 CHEMBL464538
TypeSmall organic molecule
Emp. Form.C27H38N2O
Mol. Mass.406.6023
SMILESC[N+](C)(CC=C)c1ccc(CCC(=O)CCc2ccc(cc2)[N+](C)(C)CC=C)cc1