Reaction Details
TargetRAC-gamma serine/threonine-protein kinase
LigandBDBM50275499
Substrate/Competitorn/a
Meas. Tech.ChEMBL_497147 (CHEMBL1001227)
IC50>10000±n/a nM
Citation Cheung, MHarris, PABadiang, JGPeckham, GEChamberlain, SDAlberti, MJJung, DKHarris, SSBramson, NHEpperly, AHStimpson, SAPeel, MR The identification of pyrazolo[1,5-a]pyridines as potent p38 kinase inhibitors. Bioorg Med Chem Lett18:5428-30 (2008) 
 
RAC-gamma serine/threonine-protein kinase
Name:RAC-gamma serine/threonine-protein kinase
Type:Enzyme
Mol. Mass.:55769.36
Organism:Homo sapiens (Human)
Description:n/a
Residue:479
BDBM50275499
NameBDBM50275499
Synonyms:2-(4-fluorophenyl)-3-(4-pyridinyl)pyrazolo-[1,5-a]pyridine | CHEMBL485745
TypeSmall organic molecule
Emp. Form.C18H12FN3
Mol. Mass.289.3064
SMILESFc1ccc(cc1)-c1nn2ccccc2c1-c1ccncc1