Reaction Details
TargetMitogen-activated protein kinase 14
LigandBDBM50275582
Substrate/Competitorn/a
Meas. Tech.ChEMBL_496886 (CHEMBL998555)
IC50 170±n/a nM
Citation Cheung, MHarris, PABadiang, JGPeckham, GEChamberlain, SDAlberti, MJJung, DKHarris, SSBramson, NHEpperly, AHStimpson, SAPeel, MR The identification of pyrazolo[1,5-a]pyridines as potent p38 kinase inhibitors. Bioorg Med Chem Lett18:5428-30 (2008) 
 
Mitogen-activated protein kinase 14
Name:Mitogen-activated protein kinase 14
Type:Serine/threonine-protein kinase
Mol. Mass.:41286.76
Organism:Homo sapiens (Human)
Description:Q16539
Residue:360
BDBM50275582
NameBDBM50275582
Synonyms:7-(cyclopentyloxy)-2-(4-fluorophenyl)-3-(pyridin-4-yl)pyrazolo[1,5-a]pyridine | CHEMBL488184
TypeSmall organic molecule
Emp. Form.C23H20FN3O
Mol. Mass.373.4228
SMILESFc1ccc(cc1)-c1nn2c(OC3CCCC3)cccc2c1-c1ccncc1