Reaction Details
TargetTyrosine-protein kinase ITK/TSK
LigandBDBM50274668
Substrate/Competitorn/a
Meas. Tech.ChEMBL_537167 (CHEMBL992543)
IC50 4±n/a nM
Citation Moriarty, KJWinters, MQiao, LRyan, DDesJarlis, RRobinson, DCook, BNKashem, MAKaplita, PVLiu, LHFarrell, TMKhine, HHKing, JPullen, SSRoth, GPMagolda, RTakahashi, H Itk kinase inhibitors: initial efforts to improve the metabolical stability and the cell activity of the benzimidazole lead. Bioorg Med Chem Lett18:5537-40 (2008) 
 
Tyrosine-protein kinase ITK/TSK
Name:Tyrosine-protein kinase ITK/TSK
Type:Protein
Mol. Mass.:71839.20
Organism:Homo sapiens (Human)
Description:Q08881
Residue:620
BDBM50274668
NameBDBM50274668
Synonyms:CHEMBL485030 | N-(1-(3-amino-3-oxopropyl)-2-(4-cyanobenzamido)-1H-benzo[d]imidazol-5-yl)-N-methylnicotinamide
TypeSmall organic molecule
Emp. Form.C25H21N7O3
Mol. Mass.467.4793
SMILESCN(C(=O)c1cccnc1)c1ccc2n(CCC(N)=O)c(NC(=O)c3ccc(cc3)C#N)nc2c1