Reaction Details
TargetTyrosine-protein kinase ITK/TSK
LigandBDBM50274000
Substrate/Competitorn/a
Meas. Tech.ChEMBL_537167 (CHEMBL992543)
IC50 10±n/a nM
Citation Moriarty, KJWinters, MQiao, LRyan, DDesJarlis, RRobinson, DCook, BNKashem, MAKaplita, PVLiu, LHFarrell, TMKhine, HHKing, JPullen, SSRoth, GPMagolda, RTakahashi, H Itk kinase inhibitors: initial efforts to improve the metabolical stability and the cell activity of the benzimidazole lead. Bioorg Med Chem Lett18:5537-40 (2008) 
 
Tyrosine-protein kinase ITK/TSK
Name:Tyrosine-protein kinase ITK/TSK
Type:Protein
Mol. Mass.:71839.20
Organism:Homo sapiens (Human)
Description:Q08881
Residue:620
BDBM50274000
NameBDBM50274000
Synonyms:CHEMBL460389 | N-(1-(3-amino-3-oxopropyl)-5-(N-methylbenzamido)-1H-benzo[d]imidazol-2-yl)furan-3-carboxamide
TypeSmall organic molecule
Emp. Form.C23H21N5O4
Mol. Mass.431.4439
SMILESCN(C(=O)c1ccccc1)c1ccc2n(CCC(N)=O)c(NC(=O)c3ccoc3)nc2c1