Reaction Details
TargetMonoglyceride lipase
LigandBDBM50274151
Substrate/Competitorn/a
Meas. Tech.ChEMBL_537181 (CHEMBL992557)
Ki 58700±n/a nM
Citation Magrioti, VNaxakis, GHadjipavlou-Litina, DMakriyannis, AKokotos, G A novel monoacylglycerol lipase inhibitor with analgesic and anti-inflammatory activity. Bioorg Med Chem Lett18:5424-7 (2008) 
 
Monoglyceride lipase
Name:Monoglyceride lipase
Type:Enzyme
Mol. Mass.:33505.38
Organism:Rattus norvegicus (Rat)
Description:Q8R431
Residue:303
BDBM50274151
NameBDBM50274151
Synonyms:CHEMBL473249 | hexadecane-1,2-diamine dihydrochloride
TypeSmall organic molecule
Emp. Form.C16H36N2
Mol. Mass.256.4704
(N)CN