Reaction Details
TargetTyrosine-protein kinase ITK/TSK
LigandBDBM50274470
Substrate/Competitorn/a
Meas. Tech.ChEMBL_537187 (CHEMBL992563)
IC50 4±n/a nM
Citation Moriarty, KJTakahashi, HPullen, SSKhine, HHSallati, RHRaymond, ELWoska, JRJeanfavre, DDRoth, GPWinters, MPQiao, LRyan, DDesJarlais, RRobinson, DWilson, MBobko, MCook, BNLo, HYNemoto, PAKashem, MAWolak, JPWhite, AMagolda, RLTomczuk, B Discovery, SAR and X-ray structure of 1H-benzimidazole-5-carboxylic acid cyclohexyl-methyl-amides as inhibitors of inducible T-cell kinase (Itk). Bioorg Med Chem Lett18:5545-9 (2008) 
 
Tyrosine-protein kinase ITK/TSK
Name:Tyrosine-protein kinase ITK/TSK
Type:Protein
Mol. Mass.:71839.20
Organism:Homo sapiens (Human)
Description:Q08881
Residue:620
BDBM50274470
NameBDBM50274470
Synonyms:CHEMBL485555 | N-(1-(3-amino-3-oxopropyl)-5-(N-methylcyclohexanecarboxamido)-1H-benzo[d]imidazol-2-yl)-3-cyanobenzamide
TypeSmall organic molecule
Emp. Form.C26H28N6O3
Mol. Mass.472.5389
SMILESCN(C(=O)C1CCCCC1)c1ccc2n(CCC(N)=O)c(NC(=O)c3cccc(c3)C#N)nc2c1