Reaction Details
TargetTyrosine-protein kinase ITK/TSK
LigandBDBM50274558
Substrate/Competitorn/a
Meas. Tech.ChEMBL_537187 (CHEMBL992563)
IC50 6±n/a nM
Citation Moriarty, KJTakahashi, HPullen, SSKhine, HHSallati, RHRaymond, ELWoska, JRJeanfavre, DDRoth, GPWinters, MPQiao, LRyan, DDesJarlais, RRobinson, DWilson, MBobko, MCook, BNLo, HYNemoto, PAKashem, MAWolak, JPWhite, AMagolda, RLTomczuk, B Discovery, SAR and X-ray structure of 1H-benzimidazole-5-carboxylic acid cyclohexyl-methyl-amides as inhibitors of inducible T-cell kinase (Itk). Bioorg Med Chem Lett18:5545-9 (2008) 
 
Tyrosine-protein kinase ITK/TSK
Name:Tyrosine-protein kinase ITK/TSK
Type:Protein
Mol. Mass.:71839.20
Organism:Homo sapiens (Human)
Description:Q08881
Residue:620
BDBM50274558
NameBDBM50274558
Synonyms:4-cyano-N-(5-(N-methylcyclohexanecarboxamido)-1-phenethyl-1H-benzo[d]imidazol-2-yl)benzamide | CHEMBL519347
TypeSmall organic molecule
Emp. Form.C31H31N5O2
Mol. Mass.505.6101
SMILESCN(C(=O)C1CCCCC1)c1ccc2n(CCc3ccccc3)c(NC(=O)c3ccc(cc3)C#N)nc2c1