Reaction Details
TargetTyrosine-protein kinase ITK/TSK
LigandBDBM50274631
Substrate/Competitorn/a
Meas. Tech.ChEMBL_537187 (CHEMBL992563)
IC50 9±n/a nM
Citation Moriarty, KJTakahashi, HPullen, SSKhine, HHSallati, RHRaymond, ELWoska, JRJeanfavre, DDRoth, GPWinters, MPQiao, LRyan, DDesJarlais, RRobinson, DWilson, MBobko, MCook, BNLo, HYNemoto, PAKashem, MAWolak, JPWhite, AMagolda, RLTomczuk, B Discovery, SAR and X-ray structure of 1H-benzimidazole-5-carboxylic acid cyclohexyl-methyl-amides as inhibitors of inducible T-cell kinase (Itk). Bioorg Med Chem Lett18:5545-9 (2008) 
 
Tyrosine-protein kinase ITK/TSK
Name:Tyrosine-protein kinase ITK/TSK
Type:Protein
Mol. Mass.:71839.20
Organism:Homo sapiens (Human)
Description:Q08881
Residue:620
BDBM50274631
NameBDBM50274631
Synonyms:4-cyano-N-(1-(3-(methylamino)-3-oxopropyl)-5-(N-methylcyclohexanecarboxamido)-1H-benzo[d]imidazol-2-yl)benzamide | CHEMBL483763
TypeSmall organic molecule
Emp. Form.C27H30N6O3
Mol. Mass.486.5655
SMILESCNC(=O)CCn1c(NC(=O)c2ccc(cc2)C#N)nc2cc(ccc12)N(C)C(=O)C1CCCCC1