Reaction Details
TargetCarbonic anhydrase 1
LigandBDBM50275340
Substrate/Competitorn/a
Meas. Tech.ChEMBL_497169 (CHEMBL1002069)
IC50 7640±n/a nM
Citation Bayram, ESenturk, MKufrevioglu, OISupuran, CT In vitro inhibition of salicylic acid derivatives on human cytosolic carbonic anhydrase isozymes I and II. Bioorg Med Chem16:9101-5 (2008) 
 
Carbonic anhydrase 1
Name:Carbonic anhydrase 1
Type:Enzyme
Mol. Mass.:28873.37
Organism:Homo sapiens (Human)
Description:P00915
Residue:261
BDBM50275340
NameBDBM50275340
Synonyms:4,6-Dinitro salicylic acid | CHEMBL447810
TypeSmall organic molecule
Emp. Form.C7H4N2O7
Mol. Mass.228.1159
SMILESOC(=O)c1c(O)cc(cc1[N+]([O-])=O)[N+]([O-])=O