Reaction Details
TargetCarbonic anhydrase 1
LigandBDBM50240969
Substrate/Competitorn/a
Meas. Tech.ChEMBL_497169 (CHEMBL1002069)
IC50 4070.0±n/a nM
Citation Bayram, ESenturk, MKufrevioglu, OISupuran, CT In vitro inhibition of salicylic acid derivatives on human cytosolic carbonic anhydrase isozymes I and II. Bioorg Med Chem16:9101-5 (2008) 
 
Carbonic anhydrase 1
Name:Carbonic anhydrase 1
Type:Enzyme
Mol. Mass.:28873.37
Organism:Homo sapiens (Human)
Description:P00915
Residue:261
BDBM50240969
NameBDBM50240969
Synonyms:5-Chloro-2-hydroxy-benzoic acid CHEMBL1375
TypeSmall organic molecule
Emp. Form.C7H5ClO3
Mol. Mass.172.566
SMILESOC(=O)c1cc(Cl)ccc1O