Reaction Details
TargetCarbonic anhydrase 2
LigandBDBM50275340
Substrate/Competitorn/a
Meas. Tech.ChEMBL_497174 (CHEMBL1002074)
Ki 5450±n/a nM
Citation Bayram, ESenturk, MKufrevioglu, OISupuran, CT In vitro inhibition of salicylic acid derivatives on human cytosolic carbonic anhydrase isozymes I and II. Bioorg Med Chem16:9101-5 (2008) 
 
Carbonic anhydrase 2
Name:Carbonic anhydrase 2
Type:Enzyme
Mol. Mass.:29250.71
Organism:Homo sapiens (Human)
Description:P00918
Residue:260
BDBM50275340
NameBDBM50275340
Synonyms:4,6-Dinitro salicylic acid | CHEMBL447810
TypeSmall organic molecule
Emp. Form.C7H4N2O7
Mol. Mass.228.1159
SMILESOC(=O)c1c(O)cc(cc1[N+]([O-])=O)[N+]([O-])=O