Reaction Details
TargetCarbonic anhydrase 2
LigandBDBM50240969
Substrate/Competitorn/a
Meas. Tech.ChEMBL_497175 (CHEMBL1002075)
Ki 1270±n/a nM
Citation Bayram, ESenturk, MKufrevioglu, OISupuran, CT In vitro inhibition of salicylic acid derivatives on human cytosolic carbonic anhydrase isozymes I and II. Bioorg Med Chem16:9101-5 (2008) 
 
Carbonic anhydrase 2
Name:Carbonic anhydrase 2
Type:Enzyme
Mol. Mass.:29250.71
Organism:Homo sapiens (Human)
Description:P00918
Residue:260
BDBM50240969
NameBDBM50240969
Synonyms:5-Chloro-2-hydroxy-benzoic acid CHEMBL1375
TypeSmall organic molecule
Emp. Form.C7H5ClO3
Mol. Mass.172.566
SMILESOC(=O)c1cc(Cl)ccc1O