Reaction Details
TargetMu-type opioid receptor
LigandBDBM21021
Substrate/Competitorn/a
Meas. Tech.ChEMBL_539200 (CHEMBL1024704)
EC50 32±n/a nM
Citation Yamamoto, TNair, PJacobsen, NEDavis, PMa, SWNavratilova, EMoye, SLai, JYamamura, HIVanderah, TWPorreca, FHruby, VJ The importance of micelle-bound states for the bioactivities of bifunctional peptide derivatives for delta/mu opioid receptor agonists and neurokinin 1 receptor antagonists. J Med Chem51:6334-47 (2008) 
 
Mu-type opioid receptor
Name:Mu-type opioid receptor
Type:G Protein-Coupled Receptor (GPCR)
Mol. Mass.:44503.11
Organism:Rattus norvegicus (rat)
Description:Competition binding assays were carried out using membrane preparations from transfected HN9.10 cells that constitutively expressed the mu opioid receptor.
Residue:398
BDBM21021
NameBDBM21021
Synonyms:Bifunctional Peptide Ligand, 5 (TY005) H-Tyr-D-Ala-Gly-Phe-Met-Pro-Leu-Trp-O-3,5-Bzl(CF3)2 | [3,5-bis(trifluoromethyl)phenyl]methyl (2S)-2-[(2S)-2-{[(2S)-1-[(2S)-2-[(2S)-2-{2-[(2R)-2-[(2S)-2-amino-3-(4-hydroxyphenyl)propanamido]propanamido]acetamido}-3-phenylpropanamido]-4-(methylsulfanyl)butanoyl]pyrrolidin-2-yl]formamido}-4-methylpentanamido]-3-(1H-indol-3-yl)propanoate
TypePeptide-like ligand
Emp. Form.C59H69F6N9O10S
Mol. Mass.1210.289
SMILESCSCC[C@H](NC(=O)[C@H](Cc1ccccc1)NC(=O)CNC(=O)[C@@H](C)NC(=O)[C@@H](N)Cc1ccc(O)cc1)C(=O)N1CCC[C@H]1C(=O)N[C@@H](CC(C)C)C(=O)N[C@@H](Cc1c[nH]c2ccccc12)C(=O)OCc1cc(cc(c1)C(F)(F)F)C(F)(F)F