Reaction Details
TargetDiacylglycerol lipase-alpha
LigandBDBM50274181
Substrate/Competitorn/a
Meas. Tech.ChEMBL_537915 (CHEMBL982702)
IC50 430±n/a nM
Citation Ortar, GBisogno, TLigresti, AMorera, ENalli, MDi Marzo, V Tetrahydrolipstatin analogues as modulators of endocannabinoid 2-arachidonoylglycerol metabolism. J Med Chem51:6970-9 (2008) 
 
Diacylglycerol lipase-alpha
Name:Diacylglycerol lipase-alpha
Type:PROTEIN
Mol. Mass.:114947.74
Organism:Homo sapiens (Human)
Description:ChEMBL_1449471
Residue:1042
BDBM50274181
NameBDBM50274181
Synonyms:CHEMBL484215 | N-Acetyl-L-isoleucine-(1S)-1-[[(2S,3S)-3-hexyl-4-oxo-2-oxetanyl]methyl]dodecyl Ester
TypeSmall organic molecule
Emp. Form.C30H55NO5
Mol. Mass.509.7614
SMILESCCCCCCCCCCC[C@@H](C[C@@H]1OC(=O)[C@H]1CCCCCC)OC(=O)[C@@H](NC(C)=O)C(C)CC