Reaction Details
TargetCannabinoid receptor 2
LigandBDBM50274779
Substrate/Competitorn/a
Meas. Tech.ChEMBL_537918 (CHEMBL982705)
Ki>10000±n/a nM
Citation Ortar, GBisogno, TLigresti, AMorera, ENalli, MDi Marzo, V Tetrahydrolipstatin analogues as modulators of endocannabinoid 2-arachidonoylglycerol metabolism. J Med Chem51:6970-9 (2008) 
 
Cannabinoid receptor 2
Name:Cannabinoid receptor 2
Type:G Protein-Coupled Receptor (GPCR)
Mol. Mass.:39690.94
Organism:Homo sapiens (Human)
Description:P34972
Residue:360
BDBM50274779
NameBDBM50274779
Synonyms:CHEMBL458828 | N-Acetyl-glycine-(1S)-1-[[(2S,3S)-3-hexyl-4-oxo-2-oxetanyl]methyl]dodecyl Ester
TypeSmall organic molecule
Emp. Form.C26H47NO5
Mol. Mass.453.6551
SMILESCCCCCCCCCCC[C@@H](C[C@@H]1OC(=O)[C@H]1CCCCCC)OC(=O)CNC(C)=O