Reaction Details
TargetFatty-acid amide hydrolase 1 [30-579]
LigandBDBM50274183
Substrate/Competitorn/a
Meas. Tech.ChEMBL_537919 (CHEMBL982706)
IC50>50000±n/a nM
Citation Ortar, GBisogno, TLigresti, AMorera, ENalli, MDi Marzo, V Tetrahydrolipstatin analogues as modulators of endocannabinoid 2-arachidonoylglycerol metabolism. J Med Chem51:6970-9 (2008) 
 
Fatty-acid amide hydrolase 1 [30-579]
Name:Fatty-acid amide hydrolase 1 [30-579]
Type:Single-pass membrane protein; homodimer
Mol. Mass.:60474.00
Organism:Rattus norvegicus (rat)
Description:P97612 (aa 30-579)
Residue:550
BDBM50274183
NameBDBM50274183
Synonyms:5-oxo-L-Proline-(1S)-1-[[(2S,3S)-3-hexyl-4-oxo-2-oxetanyl]methyl]dodecyl Ester | CHEMBL484393
TypeSmall organic molecule
Emp. Form.C27H47NO5
Mol. Mass.465.6658
SMILESCCCCCCCCCCC[C@@H](C[C@@H]1OC(=O)[C@H]1CCCCCC)OC(=O)[C@@H]1CCC(=O)N1