Reaction Details
TargetMitogen-activated protein kinase 1
LigandBDBM50275655
Substrate/Competitorn/a
Meas. Tech.ChEMBL_492772 (CHEMBL939460)
IC50 25600±n/a nM
Citation Park, HBahn, YJJeong, DGWoo, EJKwon, JSRyu, SE Identification of novel inhibitors of extracellular signal-regulated kinase 2 based on the structure-based virtual screening. Bioorg Med Chem Lett18:5372-6 (2008) 
 
Mitogen-activated protein kinase 1
Name:Mitogen-activated protein kinase 1
Type:Ser/Thr Protein Kinase
Mol. Mass.:41392.76
Organism:Homo sapiens (Human)
Description:P28482
Residue:360
BDBM50275655
NameBDBM50275655
Synonyms:CHEMBL486540 | N-(5-cinnamamido-1-phenyl-1H-1,2,4-triazol-3-yl)benzamide
TypeSmall organic molecule
Emp. Form.C24H19N5O2
Mol. Mass.409.44
SMILESO=C(Nc1nc(NC(=O)c2ccccc2)nn1-c1ccccc1)\C=C\c1ccccc1