Reaction Details
TargetcAMP-specific 3',5'-cyclic phosphodiesterase 4A
LigandBDBM50274031
Substrate/Competitorn/a
Meas. Tech.ChEMBL_536739 (CHEMBL984533)
IC50 0.17±n/a nM
Citation Guay, DBoulet, LFriesen, RWGirard, MHamel, PHuang, ZLaliberté, FLaliberté, SMancini, JAMuise, EPon, DStyhler, A Optimization and structure-activity relationship of a series of 1-phenyl-1,8-naphthyridin-4-one-3-carboxamides: identification of MK-0873, a potent and effective PDE4 inhibitor. Bioorg Med Chem Lett18:5554-8 (2008) 
 
cAMP-specific 3',5'-cyclic phosphodiesterase 4A
Name:cAMP-specific 3',5'-cyclic phosphodiesterase 4A
Type:Enzyme
Mol. Mass.:98113.27
Organism:Homo sapiens (Human)
Description:P27815
Residue:886
BDBM50274031
NameBDBM50274031
Synonyms:1-(3'-Acetyl-biphenyl-3-yl)-4-oxo-1,4-dihydro-[1,8]naphthyridine-3-carboxylic acid (3,4-dichloro-pyridin-2-yl)-amide | CHEMBL514564
TypeSmall organic molecule
Emp. Form.C28H18Cl2N4O3
Mol. Mass.529.374
SMILESCC(=O)c1cccc(c1)-c1cccc(c1)-n1cc(C(=O)Nc2nccc(Cl)c2Cl)c(=O)c2cccnc12