Reaction Details
TargetPotassium voltage-gated channel subfamily H member 2
LigandBDBM50274027
Substrate/Competitorn/a
Meas. Tech.ChEMBL_536741 (CHEMBL984535)
IC50 198±n/a nM
Citation Guay, DBoulet, LFriesen, RWGirard, MHamel, PHuang, ZLaliberté, FLaliberté, SMancini, JAMuise, EPon, DStyhler, A Optimization and structure-activity relationship of a series of 1-phenyl-1,8-naphthyridin-4-one-3-carboxamides: identification of MK-0873, a potent and effective PDE4 inhibitor. Bioorg Med Chem Lett18:5554-8 (2008) 
 
Potassium voltage-gated channel subfamily H member 2
Name:Potassium voltage-gated channel subfamily H member 2
Type:Multi-pass membrane protein
Mol. Mass.:126672.65
Organism:Homo sapiens (Human)
Description:Q12809
Residue:1159
BDBM50274027
NameBDBM50274027
Synonyms:1-(4-chlorophenyl)-N-(3,5-dichloropyridin-4-yl)-4-oxo-1,4-dihydro-1,8-naphthyridine-3-carboxamide | CHEMBL456171
TypeSmall organic molecule
Emp. Form.C20H11Cl3N4O2
Mol. Mass.445.686
SMILESClc1ccc(cc1)-n1cc(C(=O)Nc2c(Cl)cncc2Cl)c(=O)c2cccnc12