Reaction Details
TargetEstrogen receptor
LigandBDBM50275916
Substrate/Competitorn/a
Meas. Tech.ChEMBL_492826 (CHEMBL940315)
IC50 6.7±n/a nM
Citation Barrett, IMeegan, MJHughes, RBCarr, MKnox, AJArtemenko, NGolfis, GZisterer, DMLloyd, DG Synthesis, biological evaluation, structural-activity relationship, and docking study for a series of benzoxepin-derived estrogen receptor modulators. Bioorg Med Chem16:9554-73 (2008) 
 
Estrogen receptor
Name:Estrogen receptor
Type:Protein
Mol. Mass.:66230.44
Organism:Homo sapiens (Human)
Description:P03372
Residue:595
BDBM50275916
NameBDBM50275916
Synonyms:4-{8-Methoxy-5-[4-(2-pyrrolidin-1-yl-ethoxy)-phenyl]-2,3-dihydro-benzo[b]oxepin-4-yl}-phenol | CHEMBL511269
TypeSmall organic molecule
Emp. Form.C28H29NO4
Mol. Mass.443.5342
SMILESCOc1ccc2c(OCCC(c3ccc(O)cc3)=C2c2ccc(OCCN3CCC3)cc2)c1