Reaction Details
TargetEstrogen receptor
LigandBDBM50276004
Substrate/Competitorn/a
Meas. Tech.ChEMBL_492826 (CHEMBL940315)
IC50 6.5±n/a nM
Citation Barrett, IMeegan, MJHughes, RBCarr, MKnox, AJArtemenko, NGolfis, GZisterer, DMLloyd, DG Synthesis, biological evaluation, structural-activity relationship, and docking study for a series of benzoxepin-derived estrogen receptor modulators. Bioorg Med Chem16:9554-73 (2008) 
 
Estrogen receptor
Name:Estrogen receptor
Type:Protein
Mol. Mass.:66230.44
Organism:Homo sapiens (Human)
Description:P03372
Residue:595
BDBM50276004
NameBDBM50276004
Synonyms:4-{8-Fluoro-5-[4-(2-piperidin-1-yl-ethoxy)-phenyl]-2,3-dihydro-benzo[b]oxepin-4-yl}-phenol | CHEMBL511971
TypeSmall organic molecule
Emp. Form.C29H30FNO3
Mol. Mass.459.5518
SMILESOc1ccc(cc1)C1=C(c2ccc(OCCN3CCCCC3)cc2)c2ccc(F)cc2OCC1