Reaction Details
TargetEstrogen receptor beta
LigandBDBM50275860
Substrate/Competitorn/a
Meas. Tech.ChEMBL_492827 (CHEMBL940316)
IC50 46.1±n/a nM
Citation Barrett, IMeegan, MJHughes, RBCarr, MKnox, AJArtemenko, NGolfis, GZisterer, DMLloyd, DG Synthesis, biological evaluation, structural-activity relationship, and docking study for a series of benzoxepin-derived estrogen receptor modulators. Bioorg Med Chem16:9554-73 (2008) 
 
Estrogen receptor beta
Name:Estrogen receptor beta
Type:Protein
Mol. Mass.:59238.43
Organism:Homo sapiens (Human)
Description:Q92731
Residue:530
BDBM50275860
NameBDBM50275860
Synonyms:1-{2-[4-(4-Phenyl-2,3-dihydro-benzo[b]oxepin-5-yl)-phenoxy]-ethyl}-pyrrolidine | CHEMBL513397
TypeSmall organic molecule
Emp. Form.C27H27NO2
Mol. Mass.397.5088
SMILESC(CN1CCC1)Oc1ccc(cc1)C1=C(CCOc2ccccc12)c1ccccc1