Reaction Details
TargetHistamine H3 receptor
LigandBDBM50274736
Substrate/Competitorn/a
Meas. Tech.ChEMBL_537241 (CHEMBL981856)
IC50 0.84±n/a nM
Citation Nagase, TMizutani, TSekino, EIshikawa, SIto, SMitobe, YMiyamoto, YYoshimoto, RTanaka, TIshihara, ATakenaga, NTokita, SSato, N Synthesis and evaluation of structurally constrained quinazolinone derivatives as potent and selective histamine H3 receptor inverse agonists. J Med Chem51:6889-901 (2008) 
 
Histamine H3 receptor
Name:Histamine H3 receptor
Type:G Protein-Coupled Receptor (GPCR)
Mol. Mass.:48691.47
Organism:Homo sapiens (Human)
Description:Binding assays were using CHO cells stably expressing hH3R receptors.
Residue:445
BDBM50274736
NameBDBM50274736
Synonyms:3-(4-[(1-Cyclobutyl-4-piperidinyl)oxy]phenyl)-8-fluoro-2-methyl-4(3H)-quinazolinone | CHEMBL464599
TypeSmall organic molecule
Emp. Form.C24H26FN3O2
Mol. Mass.407.4805
SMILESCc1nc2c(F)cccc2c(=O)n1-c1ccc(OC2CCN(CC2)C2CCC2)cc1