Reaction Details
TargetHistamine H3 receptor
LigandBDBM50274077
Substrate/Competitorn/a
Meas. Tech.ChEMBL_537241 (CHEMBL981856)
IC50 14±n/a nM
Citation Nagase, TMizutani, TSekino, EIshikawa, SIto, SMitobe, YMiyamoto, YYoshimoto, RTanaka, TIshihara, ATakenaga, NTokita, SSato, N Synthesis and evaluation of structurally constrained quinazolinone derivatives as potent and selective histamine H3 receptor inverse agonists. J Med Chem51:6889-901 (2008) 
 
Histamine H3 receptor
Name:Histamine H3 receptor
Type:G Protein-Coupled Receptor (GPCR)
Mol. Mass.:48691.47
Organism:Homo sapiens (Human)
Description:Binding assays were using CHO cells stably expressing hH3R receptors.
Residue:445
BDBM50274077
NameBDBM50274077
Synonyms:3-(4-[(1-Cyclobutyl-4-piperidinyl)oxy]phenyl)-2-methylpyrido[3,2-d]pyrimidin-4(3H)-one | CHEMBL483194
TypeSmall organic molecule
Emp. Form.C23H26N4O2
Mol. Mass.390.4781
SMILESCc1nc2cccnc2c(=O)n1-c1ccc(OC2CCN(CC2)C2CCC2)cc1