Reaction Details
TargetPotassium voltage-gated channel subfamily H member 2
LigandBDBM50274798
Substrate/Competitorn/a
Meas. Tech.ChEMBL_537242 (CHEMBL981857)
IC50>10000±n/a nM
Citation Nagase, TMizutani, TSekino, EIshikawa, SIto, SMitobe, YMiyamoto, YYoshimoto, RTanaka, TIshihara, ATakenaga, NTokita, SSato, N Synthesis and evaluation of structurally constrained quinazolinone derivatives as potent and selective histamine H3 receptor inverse agonists. J Med Chem51:6889-901 (2008) 
 
Potassium voltage-gated channel subfamily H member 2
Name:Potassium voltage-gated channel subfamily H member 2
Type:Multi-pass membrane protein
Mol. Mass.:126672.65
Organism:Homo sapiens (Human)
Description:Q12809
Residue:1159
BDBM50274798
NameBDBM50274798
Synonyms:5-Chloro-3-(4-[(1-cyclobutyl-4-piperidinyl)oxy]phenyl)-2-methyl-4(3H)-quinazolinone | CHEMBL458176
TypeSmall organic molecule
Emp. Form.C24H26ClN3O2
Mol. Mass.423.935
SMILESCc1nc2cccc(Cl)c2c(=O)n1-c1ccc(OC2CCN(CC2)C2CCC2)cc1