Reaction Details
TargetHistamine H3 receptor
LigandBDBM50274235
Substrate/Competitorn/a
Meas. Tech.ChEMBL_537263 (CHEMBL981878)
Ki 2.3±n/a nM
Citation Nagase, TMizutani, TSekino, EIshikawa, SIto, SMitobe, YMiyamoto, YYoshimoto, RTanaka, TIshihara, ATakenaga, NTokita, SSato, N Synthesis and evaluation of structurally constrained quinazolinone derivatives as potent and selective histamine H3 receptor inverse agonists. J Med Chem51:6889-901 (2008) 
 
Histamine H3 receptor
Name:Histamine H3 receptor
Type:G Protein-Coupled Receptor (GPCR)
Mol. Mass.:48607.98
Organism:Rattus norvegicus (rat)
Description:n/a
Residue:445
BDBM50274235
NameBDBM50274235
Synonyms:3-(4-[(1-Cyclobutyl-4-piperidinyl)oxy]phenyl)-2-methyl-5-(trifluoromethyl)-4(3H)-quinazolinone | CHEMBL485543
TypeSmall organic molecule
Emp. Form.C25H26F3N3O2
Mol. Mass.457.488
SMILESCc1nc2cccc(c2c(=O)n1-c1ccc(OC2CCN(CC2)C2CCC2)cc1)C(F)(F)F