Reaction Details
TargetB-cell receptor CD22
LigandBDBM50274236
Substrate/Competitorn/a
Meas. Tech.ChEMBL_537287 (CHEMBL985383)
IC50 683330±n/a nM
Citation Abdu-Allah, HHTamanaka, TYu, JZhuoyuan, LSadagopan, MAdachi, TTsubata, TKelm, SIshida, HKiso, M Design, synthesis, and structure-affinity relationships of novel series of sialosides as CD22-specific inhibitors. J Med Chem51:6665-81 (2008) 
 
B-cell receptor CD22
Name:B-cell receptor CD22
Type:PROTEIN
Mol. Mass.:95348.60
Organism:Homo sapiens (Human)
Description:ChEMBL_727026
Residue:847
BDBM50274236
NameBDBM50274236
Synonyms:2-(trimethylsilyl)ethyl (5-acetamido-3,5-dideoxy-D-glycero-alpha-D-galacto-2-nonulopyranosylonic acid)-(2,6)-beta-D-galactopyranoside) | CHEMBL456656
TypeSmall organic molecule
Emp. Form.C28H45NO15Si
Mol. Mass.663.7401
SMILESCC(=O)N[C@@H]1[C@@H](O)C[C@@](OC[C@H]2O[C@@H](Oc3ccc(OCC[Si](C)(C)C)cc3)[C@H](O)[C@@H](O)[C@H]2O)(O[C@H]1[C@H](O)[C@H](O)CO)C(O)=O