Reaction Details
TargetBcl2-associated agonist of cell death
LigandBDBM50274325
Substrate/Competitorn/a
Meas. Tech.ChEMBL_537289 (CHEMBL985385)
Ki 1.4±n/a nM
Citation Park, CMBruncko, MAdickes, JBauch, JDing, HKunzer, AMarsh, KCNimmer, PShoemaker, ARSong, XTahir, SKTse, CWang, XWendt, MDYang, XZhang, HFesik, SWRosenberg, SHElmore, SW Discovery of an orally bioavailable small molecule inhibitor of prosurvival B-cell lymphoma 2 proteins. J Med Chem51:6902-15 (2008) 
 
Bcl2-associated agonist of cell death
Name:Bcl2-associated agonist of cell death
Type:PROTEIN
Mol. Mass.:18393.69
Organism:Homo sapiens (Human)
Description:ChEMBL_478760
Residue:168
BDBM50274325
NameBDBM50274325
Synonyms:(R)-4-(4-((2-(4-Chlorophenyl)-5,5-dimethylcyclohex-1-enyl)methyl)piperazin-1-yl)-N-(4-(4-(dimethylamino)-1-(phenylthio)butan-2-ylamino)-3-nitrophenylsulfonyl)benzamide | CHEMBL448740
TypeSmall organic molecule
Emp. Form.C44H53ClN6O5S2
Mol. Mass.845.512
SMILESCN(C)CC[C@H](CSc1ccccc1)Nc1ccc(cc1[N+]([O-])=O)S(=O)(=O)NC(=O)c1ccc(cc1)N1CCN(CC2=C(CCC(C)(C)C2)c2ccc(Cl)cc2)CC1