Reaction Details
TargetMetabotropic glutamate receptor 1
LigandBDBM50273940
Substrate/Competitorn/a
Meas. Tech.ChEMBL_537950 (CHEMBL1032406)
IC50 39±n/a nM
Citation Ito, SSatoh, ANagatomi, YHirata, YSuzuki, GKimura, TSatow, AMaehara, SHikichi, HHata, MKawamoto, HOhta, H Discovery and biological profile of 4-(1-aryltriazol-4-yl)-tetrahydropyridines as an orally active new class of metabotropic glutamate receptor 1 antagonist. Bioorg Med Chem16:9817-29 (2008) 
 
Metabotropic glutamate receptor 1
Name:Metabotropic glutamate receptor 1
Type:Enzyme
Mol. Mass.:132358.19
Organism:Homo sapiens (Human)
Description:Q13255
Residue:1194
BDBM50273940
NameBDBM50273940
Synonyms:CHEMBL457026 | iso-Propyl-4-[1-(2-fuluoropyridine-3-yl)-1H-1,2,3-triazol-4-yl]-3,6-dihydropyridine-1(2H)-carboxylate
TypeSmall organic molecule
Emp. Form.C16H18FN5O2
Mol. Mass.331.3448
SMILESCC(C)OC(=O)N1CCC(=CC1)c1cn(nn1)-c1cccnc1F