Reaction Details
TargetMetabotropic glutamate receptor 1
LigandBDBM50273899
Substrate/Competitorn/a
Meas. Tech.ChEMBL_537950 (CHEMBL1032406)
IC50 7±n/a nM
Citation Ito, SSatoh, ANagatomi, YHirata, YSuzuki, GKimura, TSatow, AMaehara, SHikichi, HHata, MKawamoto, HOhta, H Discovery and biological profile of 4-(1-aryltriazol-4-yl)-tetrahydropyridines as an orally active new class of metabotropic glutamate receptor 1 antagonist. Bioorg Med Chem16:9817-29 (2008) 
 
Metabotropic glutamate receptor 1
Name:Metabotropic glutamate receptor 1
Type:Enzyme
Mol. Mass.:132358.19
Organism:Homo sapiens (Human)
Description:Q13255
Residue:1194
BDBM50273899
NameBDBM50273899
Synonyms:CHEMBL456823 | tert-Butyl-4-[1-(2-fuluoropyridine-3-yl)-5-methyl-1H-1,2,3-triazol-4-yl]-3,6-dihydropyridine-1(2H)-carboxylate
TypeSmall organic molecule
Emp. Form.C18H22FN5O2
Mol. Mass.359.398
SMILESCc1c(nnn1-c1ncccc1F)C1=CCN(CC1)C(=O)OC(C)(C)C