Reaction Details
TargetNeuropeptide Y receptor type 1
LigandBDBM50060728
Substrate/Competitorn/a
Meas. Tech.ChEMBL_537978 (CHEMBL1032434)
Ki 1.3±n/a nM
Citation Weiss, SKeller, MBernhardt, GBuschauer, AKönig, B Modular synthesis of non-peptidic bivalent NPY Y1 receptor antagonists. Bioorg Med Chem16:9858-66 (2008) 
 
Neuropeptide Y receptor type 1
Name:Neuropeptide Y receptor type 1
Type:Enzyme Catalytic Domain
Mol. Mass.:44399.07
Organism:Homo sapiens (Human)
Description:NPY-Y1 NPY1R HUMAN::P25929
Residue:384
BDBM50060728
NameBDBM50060728
Synonyms:(R)-2-(2,2-diphenylacetamido)-5-guanidino-N-(4-hydroxybenzyl)pentanamide (R)-5-(diaminomethyleneamino)-2-(2,2-diphenylacetamido)-N-(4-hydroxybenzyl)pentanamide | CHEMBL332347
TypeSmall organic molecule
Emp. Form.C27H31N5O3
Mol. Mass.473.5667
SMILES[#7]\[#6](-[#7])=[#7]\[#6]-[#6]-[#6]-[#6@@H](-[#7]-[#6](=O)-[#6](-c1ccccc1)-c1ccccc1)-[#6](=O)-[#7]-[#6]-c1ccc(-[#8])cc1