Reaction Details
TargetNeuropeptide Y receptor type 1
LigandBDBM50273944
Substrate/Competitorn/a
Meas. Tech.ChEMBL_537978 (CHEMBL1032434)
Ki 43±n/a nM
Citation Weiss, SKeller, MBernhardt, GBuschauer, AKönig, B Modular synthesis of non-peptidic bivalent NPY Y1 receptor antagonists. Bioorg Med Chem16:9858-66 (2008) 
 
Neuropeptide Y receptor type 1
Name:Neuropeptide Y receptor type 1
Type:Enzyme Catalytic Domain
Mol. Mass.:44399.07
Organism:Homo sapiens (Human)
Description:NPY-Y1 NPY1R HUMAN::P25929
Residue:384
BDBM50273944
NameBDBM50273944
Synonyms:(E)-{[4-(4-{4-[1-(4-{[(1Z)-Ammonio({(4R)-4-[(diphenylacetyl)amino]-5-[(4-hydroxybenzyl)amino]-5-oxopentyl}amino)methylene]amino}-4-oxobutyl)-1H-1,2,3-triazol-4-yl]phenyl}-1H-1,2,3-triazol-1-yl)butanoyl]amino}-({(4R)-4-[(diphenylacetyl)amino]-5-[(4-hydroxybenzyl)amino]-5-oxopentyl}imino)methanaminium bis(trifluoroacetate) | CHEMBL501317
TypeSmall organic molecule
Emp. Form.C72H80N16O8
Mol. Mass.1297.5069
SMILES[NH3+]C(NC(=O)CCCn1cc(nn1)-c1ccc(cc1)-c1cn(CCCC(=O)NC([NH3+])=NCCC[C@@H](NC(=O)C(c2ccccc2)c2ccccc2)C(=O)NCc2ccc(O)cc2)nn1)=NCCC[C@@H](NC(=O)C(c1ccccc1)c1ccccc1)C(=O)NCc1ccc(O)cc1