Reaction Details
TargetCyclin-dependent kinase 2
LigandBDBM50246413
Substrate/Competitorn/a
Meas. Tech.ChEMBL_557990 (CHEMBL965585)
IC50 17±n/a nM
Citation Fan, JFahr, BStockett, DChan, ECheeti, SSerafimova, ILu, YPham, PWalker, DHHoch, UChoong, IC Modifications of the isonipecotic acid fragment of SNS-032: analogs with improved permeability and lower efflux ratio. Bioorg Med Chem Lett18:6236-9 (2008) 
 
Cyclin-dependent kinase 2
Name:Cyclin-dependent kinase 2
Type:Enzyme Subunit
Mol. Mass.:33938.17
Organism:Homo sapiens (Human)
Description:P24941
Residue:298
BDBM50246413
NameBDBM50246413
Synonyms:CHEMBL509012 | N-(5-((5-tert-butyloxazol-2-yl)methylthio)thiazol-2-yl)-2-isopropylpiperidine-4-carboxamide
TypeSmall organic molecule
Emp. Form.C20H30N4O2S2
Mol. Mass.422.608
SMILESCC(C)C1CC(CCN1)C(=O)Nc1ncc(SCc2ncc(o2)C(C)(C)C)s1