Reaction Details
TargetP2Y purinoceptor 1
LigandBDBM50245983
Substrate/Competitorn/a
Meas. Tech.ChEMBL_558003 (CHEMBL965598)
IC50 600±n/a nM
Citation Morales-Ramos, AIMecom, JSKiesow, TJGraybill, TLBrown, GDAiyar, NVDavenport, EAKallal, LAKnapp-Reed, BALi, PLondregan, ATMorrow, DMSenadhi, SThalji, RKZhao, SBurns-Kurtis, CLMarino, JP Tetrahydro-4-quinolinamines identified as novel P2Y(1) receptor antagonists. Bioorg Med Chem Lett18:6222-6 (2008) 
 
P2Y purinoceptor 1
Name:P2Y purinoceptor 1
Type:Enzyme
Mol. Mass.:42090.25
Organism:Homo sapiens (Human)
Description:P47900
Residue:373
BDBM50245983
NameBDBM50245983
Synonyms:(2R,3S,4S)-2-Ethyl-3-methyl-N-[3,5-(chloro)phenyl]-4-(phenylamino)-3,4-dihydro-1(2H)-quinolinecarboxamide CHEMBL462373
TypeSmall organic molecule
Emp. Form.C25H25Cl2N3O
Mol. Mass.454.392
SMILESCC[C@@H]1[C@@H](C)[C@H](Nc2ccccc2)c2ccccc2N1C(=O)Nc1cc(Cl)cc(Cl)c1