Reaction Details
TargetP2Y purinoceptor 1
LigandBDBM50245981
Substrate/Competitorn/a
Meas. Tech.ChEMBL_558004 (CHEMBL965599)
Ki 400±n/a nM
Citation Morales-Ramos, AIMecom, JSKiesow, TJGraybill, TLBrown, GDAiyar, NVDavenport, EAKallal, LAKnapp-Reed, BALi, PLondregan, ATMorrow, DMSenadhi, SThalji, RKZhao, SBurns-Kurtis, CLMarino, JP Tetrahydro-4-quinolinamines identified as novel P2Y(1) receptor antagonists. Bioorg Med Chem Lett18:6222-6 (2008) 
 
P2Y purinoceptor 1
Name:P2Y purinoceptor 1
Type:Enzyme
Mol. Mass.:42090.25
Organism:Homo sapiens (Human)
Description:P47900
Residue:373
BDBM50245981
NameBDBM50245981
Synonyms:(2R,3S,4S)-2-ethyl-3-methyl-N-phenyl-4-(phenylamino)-3,4-dihydroquinoline-1(2H)-carboxamide | CHEMBL461325
TypeSmall organic molecule
Emp. Form.C25H27N3O
Mol. Mass.385.5014
SMILESCC[C@@H]1[C@@H](C)[C@H](Nc2ccccc2)c2ccccc2N1C(=O)Nc1ccccc1