Reaction Details
TargetSerine/threonine-protein kinase PLK3
LigandBDBM50275752
Substrate/Competitorn/a
Meas. Tech.ChEMBL_492861 (CHEMBL942192)
IC50 30±n/a nM
Citation Cheung, MKuntz, KWPobanz, MSalovich, JMWilson, BJAndrews, CWShewchuk, LMEpperly, AHHassler, DFLeesnitzer, MASmith, JLSmith, GKLansing, TJMook, RA Imidazo[5,1-f][1,2,4]triazin-2-amines as novel inhibitors of polo-like kinase 1. Bioorg Med Chem Lett18:6214-7 (2008) 
 
Serine/threonine-protein kinase PLK3
Name:Serine/threonine-protein kinase PLK3
Type:Serine/threonine-protein kinase
Mol. Mass.:71655.17
Organism:Homo sapiens (Human)
Description:Enzyme assays were using PLK3 purified from baculovirus-infected Trichoplusia ni cells expressing full-length PLK3.
Residue:646
BDBM50275752
NameBDBM50275752
Synonyms:5-methyl-7-(3-(trifluoromethyl)phenyl)-N-(3,4,5-trimethoxyphenyl)imidazo[1,5-f][1,2,4]triazin-2-amine | CHEMBL520037
TypeSmall organic molecule
Emp. Form.C22H20F3N5O3
Mol. Mass.459.4211
SMILESCOc1cc(Nc2ncc3c(C)nc(-c4cccc(c4)C(F)(F)F)n3n2)cc(OC)c1OC