Reaction Details
TargetSerine/threonine-protein kinase PLK1
LigandBDBM50275752
Substrate/Competitorn/a
Meas. Tech.ChEMBL_492860 (CHEMBL942191)
IC50 30±n/a nM
Citation Cheung, MKuntz, KWPobanz, MSalovich, JMWilson, BJAndrews, CWShewchuk, LMEpperly, AHHassler, DFLeesnitzer, MASmith, JLSmith, GKLansing, TJMook, RA Imidazo[5,1-f][1,2,4]triazin-2-amines as novel inhibitors of polo-like kinase 1. Bioorg Med Chem Lett18:6214-7 (2008) 
 
Serine/threonine-protein kinase PLK1
Name:Serine/threonine-protein kinase PLK1
Type:Serine/threonine-protein kinase
Mol. Mass.:68277.16
Organism:Homo sapiens (Human)
Description:P53350
Residue:603
BDBM50275752
NameBDBM50275752
Synonyms:5-methyl-7-(3-(trifluoromethyl)phenyl)-N-(3,4,5-trimethoxyphenyl)imidazo[1,5-f][1,2,4]triazin-2-amine | CHEMBL520037
TypeSmall organic molecule
Emp. Form.C22H20F3N5O3
Mol. Mass.459.4211
SMILESCOc1cc(Nc2ncc3c(C)nc(-c4cccc(c4)C(F)(F)F)n3n2)cc(OC)c1OC